Reaction Details
TargetNon-receptor tyrosine-protein kinase TYK2
LigandBDBM50355501
Substrate/Competitorn/a
Meas. Tech.ChEMBL_856882 (CHEMBL2160363)
Ki 0.5±n/a nM
Citation Zak, MMendonca, RBalazs, MBarrett, KBergeron, PBlair, WSChang, CDeshmukh, GDevoss, JDragovich, PSEigenbrot, CGhilardi, NGibbons, PGradl, SHamman, CHanan, EJHarstad, EHewitt, PRHurley, CAJin, TJohnson, AJohnson, TKenny, JRKoehler, MFBir Kohli, PKulagowski, JJLabadie, SLiao, JLiimatta, MLin, ZLupardus, PJMaxey, RJMurray, JMPulk, RRodriguez, MSavage, SShia, SSteffek, MUbhayakar, SUltsch, Mvan Abbema, AWard, SIXiao, LXiao, Y Discovery and optimization of C-2 methyl imidazopyrrolopyridines as potent and orally bioavailable JAK1 inhibitors with selectivity over JAK2. J Med Chem55:6176-93 (2012) 
 
Non-receptor tyrosine-protein kinase TYK2
Name:Non-receptor tyrosine-protein kinase TYK2
Type:Protein
Mol. Mass.:133666.03
Organism:Homo sapiens (Human)
Description:P29597
Residue:1187
BDBM50355501
NameBDBM50355501
Synonyms:INCB-018424 RUXOLITINIB PHOSPHATE US10766894, Compound TABLE 1.1 US11203595, TABLE 1.1 | US11279703, TABLE 6.147
TypeSmall organic molecule
Emp. Form.C17H18N6
Mol. Mass.306.365
SMILESN#CC[C@H](C1CCCC1)n1cc(cn1)-c1ncnc2[nH]ccc12