Reaction Details
TargetTyrosine-protein kinase JAK1
LigandBDBM50393741
Substrate/Competitorn/a
Meas. Tech.ChEMBL_856883 (CHEMBL2160364)
EC50 190±n/a nM
Citation Zak, MMendonca, RBalazs, MBarrett, KBergeron, PBlair, WSChang, CDeshmukh, GDevoss, JDragovich, PSEigenbrot, CGhilardi, NGibbons, PGradl, SHamman, CHanan, EJHarstad, EHewitt, PRHurley, CAJin, TJohnson, AJohnson, TKenny, JRKoehler, MFBir Kohli, PKulagowski, JJLabadie, SLiao, JLiimatta, MLin, ZLupardus, PJMaxey, RJMurray, JMPulk, RRodriguez, MSavage, SShia, SSteffek, MUbhayakar, SUltsch, Mvan Abbema, AWard, SIXiao, LXiao, Y Discovery and optimization of C-2 methyl imidazopyrrolopyridines as potent and orally bioavailable JAK1 inhibitors with selectivity over JAK2. J Med Chem55:6176-93 (2012) 
 
Tyrosine-protein kinase JAK1
Name:Tyrosine-protein kinase JAK1
Type:Protein
Mol. Mass.:133293.73
Organism:Homo sapiens (Human)
Description:P23458
Residue:1154
BDBM50393741
NameBDBM50393741
Synonyms:CHEMBL2159215
TypeSmall organic molecule
Emp. Form.C14H16N4O
Mol. Mass.256.303
SMILESCc1nc2cnc3[nH]ccc3c2n1[C@H]1CC[C@@H](O)C1