Reaction Details
TargetTyrosine-protein kinase JAK2
LigandBDBM50393739
Substrate/Competitorn/a
Meas. Tech.ChEMBL_856880 (CHEMBL2160361)
Ki 2.9±n/a nM
Citation Zak, MMendonca, RBalazs, MBarrett, KBergeron, PBlair, WSChang, CDeshmukh, GDevoss, JDragovich, PSEigenbrot, CGhilardi, NGibbons, PGradl, SHamman, CHanan, EJHarstad, EHewitt, PRHurley, CAJin, TJohnson, AJohnson, TKenny, JRKoehler, MFBir Kohli, PKulagowski, JJLabadie, SLiao, JLiimatta, MLin, ZLupardus, PJMaxey, RJMurray, JMPulk, RRodriguez, MSavage, SShia, SSteffek, MUbhayakar, SUltsch, Mvan Abbema, AWard, SIXiao, LXiao, Y Discovery and optimization of C-2 methyl imidazopyrrolopyridines as potent and orally bioavailable JAK1 inhibitors with selectivity over JAK2. J Med Chem55:6176-93 (2012) 
 
Tyrosine-protein kinase JAK2
Name:Tyrosine-protein kinase JAK2
Type:Protein
Mol. Mass.:130684.68
Organism:Homo sapiens (Human)
Description:O60674
Residue:1132
BDBM50393739
NameBDBM50393739
Synonyms:CHEMBL2159142
TypeSmall organic molecule
Emp. Form.C21H23N5
Mol. Mass.345.4408
SMILESCc1nc2cnc3[nH]ccc3c2n1C1CCN(Cc2ccccc2)CC1