Reaction Details
TargetMethionine--tRNA ligase, cytoplasmic
LigandBDBM50393798
Substrate/Competitorn/a
Meas. Tech.ChEMBL_854755 (CHEMBL2161886)
IC50 3720±n/a nM
Citation Shibata, SGillespie, JRRanade, RMKoh, CYKim, JELaydbak, JUZucker, FHHol, WGVerlinde, CLBuckner, FSFan, E Urea-based inhibitors of Trypanosoma brucei methionyl-tRNA synthetase: selectivity and in vivo characterization. J Med Chem55:6342-51 (2012) 
 
Methionine--tRNA ligase, cytoplasmic
Name:Methionine--tRNA ligase, cytoplasmic
Type:PROTEIN
Mol. Mass.:101110.04
Organism:Homo sapiens (Human)
Description:ChEMBL_105283
Residue:900
BDBM50393798
NameBDBM50393798
Synonyms:CHEMBL2159525
TypeSmall organic molecule
Emp. Form.C17H19Cl2N3O2
Mol. Mass.368.258
SMILESOc1ccccc1NC(=O)NCCCNCc1cc(Cl)cc(Cl)c1