Reaction Details
TargetMethionine--tRNA ligase, cytoplasmic
LigandBDBM50393799
Substrate/Competitorn/a
Meas. Tech.ChEMBL_854755 (CHEMBL2161886)
IC50 5430±n/a nM
Citation Shibata, SGillespie, JRRanade, RMKoh, CYKim, JELaydbak, JUZucker, FHHol, WGVerlinde, CLBuckner, FSFan, E Urea-based inhibitors of Trypanosoma brucei methionyl-tRNA synthetase: selectivity and in vivo characterization. J Med Chem55:6342-51 (2012) 
 
Methionine--tRNA ligase, cytoplasmic
Name:Methionine--tRNA ligase, cytoplasmic
Type:PROTEIN
Mol. Mass.:101110.04
Organism:Homo sapiens (Human)
Description:ChEMBL_105283
Residue:900
BDBM50393799
NameBDBM50393799
Synonyms:CHEMBL2159526
TypeSmall organic molecule
Emp. Form.C17H19Cl2N3O2
Mol. Mass.368.258
SMILESOc1cccc(NC(=O)NCCCNCc2cc(Cl)cc(Cl)c2)c1