Reaction Details
TargetPotassium voltage-gated channel subfamily H member 2
LigandBDBM50394054
Substrate/Competitorn/a
Meas. Tech.ChEMBL_856088 (CHEMBL2162322)
IC50>30000±n/a nM
Citation Davies, NGBrowne, HDavis, BDrysdale, MJFoloppe, NGeoffrey, SGibbons, BHart, THubbard, RJensen, MRMansell, HMassey, AMatassova, NMoore, JDMurray, JPratt, RRay, SRobertson, ARoughley, SDSchoepfer, JScriven, KSimmonite, HStokes, SSurgenor, AWebb, PWood, MWright, LBrough, P Targeting conserved water molecules: design of 4-aryl-5-cyanopyrrolo[2,3-d]pyrimidine Hsp90 inhibitors using fragment-based screening and structure-based optimization. Bioorg Med Chem20:6770-89 (2012) 
 
Potassium voltage-gated channel subfamily H member 2
Name:Potassium voltage-gated channel subfamily H member 2
Type:Multi-pass membrane protein
Mol. Mass.:126672.65
Organism:Homo sapiens (Human)
Description:Q12809
Residue:1159
BDBM50394054
NameBDBM50394054
Synonyms:CHEMBL2158561
TypeSmall organic molecule
Emp. Form.C18H16ClN5O3S
Mol. Mass.417.869
SMILESCOc1cc(Cl)c(cc1O)-c1nc(SCC(=O)N(C)C)nc2[nH]cc(C#N)c12