Reaction Details
TargetHeat shock protein HSP 90-beta
LigandBDBM50394085
Substrate/Competitorn/a
Meas. Tech.ChEMBL_856085 (CHEMBL2162319)
Ki 661±n/a nM
Citation Davies, NGBrowne, HDavis, BDrysdale, MJFoloppe, NGeoffrey, SGibbons, BHart, THubbard, RJensen, MRMansell, HMassey, AMatassova, NMoore, JDMurray, JPratt, RRay, SRobertson, ARoughley, SDSchoepfer, JScriven, KSimmonite, HStokes, SSurgenor, AWebb, PWood, MWright, LBrough, P Targeting conserved water molecules: design of 4-aryl-5-cyanopyrrolo[2,3-d]pyrimidine Hsp90 inhibitors using fragment-based screening and structure-based optimization. Bioorg Med Chem20:6770-89 (2012) 
 
Heat shock protein HSP 90-beta
Name:Heat shock protein HSP 90-beta
Type:Molecular Chaperone
Mol. Mass.:83229.45
Organism:Homo sapiens (Human)
Description:P08238
Residue:724
BDBM50394085
NameBDBM50394085
Synonyms:CHEMBL2158635
TypeSmall organic molecule
Emp. Form.C13H11ClN4S
Mol. Mass.290.771
SMILESCSc1nc(-c2ccc(Cl)cc2C)c2[nH]cnc2n1