Reaction Details
TargetSerine/threonine-protein kinase mTOR
LigandBDBM50394167
Substrate/Competitorn/a
Meas. Tech.ChEMBL_856498 (CHEMBL2161544)
IC50 890±n/a nM
Citation Gopalsamy, ABennett, EMShi, MZhang, WGBard, JYu, K Identification of pyrimidine derivatives as hSMG-1 inhibitors. Bioorg Med Chem Lett22:6636-41 (2012) 
 
Serine/threonine-protein kinase mTOR
Name:Serine/threonine-protein kinase mTOR
Type:Rapamycin target protein
Mol. Mass.:288917.12
Organism:Homo sapiens (Human)
Description:P42345
Residue:2549
BDBM50394167
NameBDBM50394167
Synonyms:CHEMBL2158842
TypeSmall organic molecule
Emp. Form.C22H23N5O3S
Mol. Mass.437.515
SMILESNS(=O)(=O)c1ccc(Nc2nccc(n2)-c2cccc(c2)C(=O)N2CCCCC2)cc1