Reaction Details
TargetSerine/threonine-protein kinase SMG1
LigandBDBM50394186
Substrate/Competitorn/a
Meas. Tech.ChEMBL_856497 (CHEMBL2161543)
IC50 3±n/a nM
Citation Gopalsamy, ABennett, EMShi, MZhang, WGBard, JYu, K Identification of pyrimidine derivatives as hSMG-1 inhibitors. Bioorg Med Chem Lett22:6636-41 (2012) 
 
Serine/threonine-protein kinase SMG1
Name:Serine/threonine-protein kinase SMG1
Type:PROTEIN
Mol. Mass.:410490.32
Organism:Homo sapiens (Human)
Description:ChEMBL_856497
Residue:3661
BDBM50394186
NameBDBM50394186
Synonyms:CHEMBL2158853
TypeSmall organic molecule
Emp. Form.C19H22N6O2S
Mol. Mass.398.482
SMILESCCN(CC)c1cc(ccn1)-c1ccnc(Nc2cccc(c2)S(N)(=O)=O)n1