Reaction Details
TargetPurine nucleoside phosphorylase
LigandBDBM50195587
Substrate/Competitorn/a
Meas. Tech.ChEMBL_854810 (CHEMBL2162055)
Kd 0.023±n/a nM
Citation Wielgus-Kutrowska, BBreer, KHashimoto, MHikishima, SYokomatsu, TNarczyk, MDyzma, AGirstun, AStaron, KBzowska, A Trimeric purine nucleoside phosphorylase: exploring postulated one-third-of-the-sites binding in the transition state. Bioorg Med Chem20:6758-69 (2012) 
 
Purine nucleoside phosphorylase
Name:Purine nucleoside phosphorylase
Type:Enzyme
Mol. Mass.:32035.18
Organism:Bos taurus (bovine)
Description:n/a
Residue:289
BDBM50195587
NameBDBM50195587
Synonyms:1,4-DIDEOXY-4-AZA-1-(S)-(9-DEAZAHYPOXANTHIN-9-YL)-D-RIBITOL CHEMBL1213652 Immucillin-H
TypeSmall organic molecule
Emp. Form.C11H14N4O4
Mol. Mass.266.2533
SMILESOC[C@H]1N[C@H]([C@H](O)[C@@H]1O)c1c[nH]c2c1nc[nH]c2=O