Reaction Details
TargetPurine nucleoside phosphorylase
LigandBDBM50214705
Substrate/Competitorn/a
Meas. Tech.ChEMBL_854808 (CHEMBL2162053)
Kd 0.46±n/a nM
Citation Wielgus-Kutrowska, BBreer, KHashimoto, MHikishima, SYokomatsu, TNarczyk, MDyzma, AGirstun, AStaron, KBzowska, A Trimeric purine nucleoside phosphorylase: exploring postulated one-third-of-the-sites binding in the transition state. Bioorg Med Chem20:6758-69 (2012) 
 
Purine nucleoside phosphorylase
Name:Purine nucleoside phosphorylase
Type:Enzyme
Mol. Mass.:32035.18
Organism:Bos taurus (bovine)
Description:n/a
Residue:289
BDBM50214705
NameBDBM50214705
Synonyms:5-(2-amino-6-oxo-1,6-dihydro-9H-purin-9-yl)-1,1-difluoropentylphosphonate 9-(5,5-DIFLUORO-5-PHOSPHONOPENTYL)GUANINE [5-(2-Amino-6-oxo-1,6-dihydro-purin-9-yl)-1,1-difluoro-pentyl]-phosphonic acid
TypeSmall organic molecule
Emp. Form.C10H14F2N5O4P
Mol. Mass.337.2198
SMILESNc1nc2n(CCCCC(F)(F)P(O)(O)=O)cnc2c(=O)[nH]1