Reaction Details
TargetBeta-secretase 1
LigandBDBM50394446
Substrate/Competitorn/a
Meas. Tech.ChEMBL_854822 (CHEMBL2162067)
IC50 310±n/a nM
Citation Peng, DYSun, QZhu, XLLin, HYChen, QYu, NXYang, WCYang, GF Design, synthesis, and bioevaluation of benzamides: novel acetylcholinesterase inhibitors with multi-functions on butylcholinesterase, Aß aggregation, andß-secretase. Bioorg Med Chem20:6739-50 (2012) 
 
Beta-secretase 1
Name:Beta-secretase 1
Type:Protein
Mol. Mass.:55755.10
Organism:Homo sapiens (Human)
Description:P56817
Residue:501
BDBM50394446
NameBDBM50394446
Synonyms:CHEMBL2159663
TypeSmall organic molecule
Emp. Form.C25H27N2O3
Mol. Mass.403.4929
SMILESCC(=O)c1ccccc1NC(=O)c1ccc(OCCCCC[n+]2ccccc2)cc1