Reaction Details
TargetCholinesterase
LigandBDBM50394445
Substrate/Competitorn/a
Meas. Tech.ChEMBL_854818 (CHEMBL2162063)
Ki 66±n/a nM
Citation Peng, DYSun, QZhu, XLLin, HYChen, QYu, NXYang, WCYang, GF Design, synthesis, and bioevaluation of benzamides: novel acetylcholinesterase inhibitors with multi-functions on butylcholinesterase, Aß aggregation, andß-secretase. Bioorg Med Chem20:6739-50 (2012) 
 
Cholinesterase
Name:Cholinesterase
Type:Homotetramer
Mol. Mass.:68422.27
Organism:Homo sapiens (Human)
Description:P06276
Residue:602
BDBM50394445
NameBDBM50394445
Synonyms:CHEMBL2159664
TypeSmall organic molecule
Emp. Form.C26H29N2O3
Mol. Mass.417.5195
SMILESCC(=O)c1ccccc1NC(=O)c1ccc(OCCCCCC[n+]2ccccc2)cc1