Reaction Details
TargetAcetylcholinesterase
LigandBDBM50394448
Substrate/Competitorn/a
Meas. Tech.ChEMBL_854817 (CHEMBL2162062)
Ki 9.4±n/a nM
Citation Peng, DYSun, QZhu, XLLin, HYChen, QYu, NXYang, WCYang, GF Design, synthesis, and bioevaluation of benzamides: novel acetylcholinesterase inhibitors with multi-functions on butylcholinesterase, Aß aggregation, andß-secretase. Bioorg Med Chem20:6739-50 (2012) 
 
Acetylcholinesterase
Name:Acetylcholinesterase
Type:Enzyme
Mol. Mass.:67792.70
Organism:Homo sapiens (Human)
Description:P22303
Residue:614
BDBM50394448
NameBDBM50394448
Synonyms:CHEMBL2159661
TypeSmall organic molecule
Emp. Form.C30H31N2O3
Mol. Mass.467.5782
SMILESCC(=O)c1ccccc1NC(=O)c1ccc(OCCCCCC[n+]2ccc3ccccc3c2)cc1