Reaction Details
TargetCorticotropin-releasing factor receptor 1
LigandBDBM50389532
Substrate/Competitorn/a
Meas. Tech.ChEMBL_855116 (CHEMBL2160874)
IC50 23±n/a nM
Citation Takeda, KTerauchi, THashizume, MShikata, KTaguchi, RMurata-Tai, KFujisawa, MTakahashi, YShin, KIno, MShibata, HYonaga, M Synthesis and structure-activity relationships of 8-substituted-2-aryl-5-alkylaminoquinolines: Potent, orally active corticotropin-releasing factor-1 receptor antagonists. Bioorg Med Chem20:6559-78 (2012) 
 
Corticotropin-releasing factor receptor 1
Name:Corticotropin-releasing factor receptor 1
Type:Enzyme
Mol. Mass.:50744.31
Organism:Homo sapiens (Human)
Description:P34998
Residue:444
BDBM50389532
NameBDBM50389532
Synonyms:CHEMBL2063375
TypeSmall organic molecule
Emp. Form.C26H34N2O4
Mol. Mass.438.5592
SMILESCCN(CCOC)c1ccc(C)c2nc(c(C)cc12)-c1c(OC)cc(COC)cc1OC