Reaction Details
TargetHistamine H2 receptor
LigandBDBM50394694
Substrate/Competitorn/a
Meas. Tech.ChEMBL_858644 (CHEMBL2166526)
EC50 0.603±n/a nM
Citation Birnkammer, TSpickenreither, ABrunskole, ILopuch, MKagermeier, NBernhardt, GDove, SSeifert, RElz, SBuschauer, A The bivalent ligand approach leads to highly potent and selective acylguanidine-type histamine H2 receptor agonists. J Med Chem55:1147-60 (2012) 
 
Histamine H2 receptor
Name:Histamine H2 receptor
Type:G Protein-Coupled Receptor (GPCR)
Mol. Mass.:40567.22
Organism:Cavia porcellus (domestic guinea pig)
Description:For the H2 receptor-binding assays, guinea pig striatum was used.
Residue:359
BDBM50394694
NameBDBM50394694
Synonyms:CHEMBL2165642
TypeSmall organic molecule
Emp. Form.C24H40N10O2
Mol. Mass.500.6402
SMILESNC(NC(=O)CCCCCCCCC(=O)NC(=N)NCCCc1cnc[nH]1)=NCCCc1cnc[nH]1