Reaction Details
TargetHistamine H4 receptor
LigandBDBM50394705
Substrate/Competitorn/a
Meas. Tech.ChEMBL_858635 (CHEMBL2166517)
EC50 338.84±n/a nM
Citation Birnkammer, TSpickenreither, ABrunskole, ILopuch, MKagermeier, NBernhardt, GDove, SSeifert, RElz, SBuschauer, A The bivalent ligand approach leads to highly potent and selective acylguanidine-type histamine H2 receptor agonists. J Med Chem55:1147-60 (2012) 
 
Histamine H4 receptor
Name:Histamine H4 receptor
Type:G Protein-Coupled Receptor (GPCR)
Mol. Mass.:44517.02
Organism:Homo sapiens (Human)
Description:Binding assays were using CHO cells stably expressing hH4R receptors.
Residue:390
BDBM50394705
NameBDBM50394705
Synonyms:CHEMBL2165643
TypeSmall organic molecule
Emp. Form.C30H52N10O2
Mol. Mass.584.7997
SMILESNC(NC(=O)CCCCCCCCCCCCCCC(=O)NC(=N)NCCCc1cnc[nH]1)=NCCCc1cnc[nH]1