Reaction Details
TargetHistamine H4 receptor
LigandBDBM50394707
Substrate/Competitorn/a
Meas. Tech.ChEMBL_858635 (CHEMBL2166517)
EC50 79.43±n/a nM
Citation Birnkammer, TSpickenreither, ABrunskole, ILopuch, MKagermeier, NBernhardt, GDove, SSeifert, RElz, SBuschauer, A The bivalent ligand approach leads to highly potent and selective acylguanidine-type histamine H2 receptor agonists. J Med Chem55:1147-60 (2012) 
 
Histamine H4 receptor
Name:Histamine H4 receptor
Type:G Protein-Coupled Receptor (GPCR)
Mol. Mass.:44517.02
Organism:Homo sapiens (Human)
Description:Binding assays were using CHO cells stably expressing hH4R receptors.
Residue:390
BDBM50394707
NameBDBM50394707
Synonyms:CHEMBL2165640
TypeSmall organic molecule
Emp. Form.C20H32N10O2
Mol. Mass.444.5339
SMILESN=C(NCCCc1cnc[nH]1)NC(=O)CCCCC(=O)NC(=N)NCCCc1cnc[nH]1