Reaction Details
TargetHistamine H2 receptor
LigandBDBM50394696
Substrate/Competitorn/a
Meas. Tech.ChEMBL_858640 (CHEMBL2166522)
EC50 34.67±n/a nM
Citation Birnkammer, TSpickenreither, ABrunskole, ILopuch, MKagermeier, NBernhardt, GDove, SSeifert, RElz, SBuschauer, A The bivalent ligand approach leads to highly potent and selective acylguanidine-type histamine H2 receptor agonists. J Med Chem55:1147-60 (2012) 
 
Histamine H2 receptor
Name:Histamine H2 receptor
Type:G Protein-Coupled Receptor (GPCR)
Mol. Mass.:40567.22
Organism:Cavia porcellus (domestic guinea pig)
Description:For the H2 receptor-binding assays, guinea pig striatum was used.
Residue:359
BDBM50394696
NameBDBM50394696
Synonyms:CHEMBL2165634
TypeSmall organic molecule
Emp. Form.C32H56N10O2S2
Mol. Mass.676.983
SMILESCc1nc(N)sc1CCCNC(=N)NC(=O)CCCCCCCCCCCCCCC(=O)NC(=N)NCCCc1sc(N)nc1C