Reaction Details
TargetHistamine H2 receptor
LigandBDBM50394703
Substrate/Competitorn/a
Meas. Tech.ChEMBL_858637 (CHEMBL2166519)
EC50 7.59±n/a nM
Citation Birnkammer, TSpickenreither, ABrunskole, ILopuch, MKagermeier, NBernhardt, GDove, SSeifert, RElz, SBuschauer, A The bivalent ligand approach leads to highly potent and selective acylguanidine-type histamine H2 receptor agonists. J Med Chem55:1147-60 (2012) 
 
Histamine H2 receptor
Name:Histamine H2 receptor
Type:G Protein-Coupled Receptor (GPCR)
Mol. Mass.:40115.31
Organism:Homo sapiens (Human)
Description:n/a
Residue:359
BDBM50394703
NameBDBM50394703
Synonyms:CHEMBL2165628
TypeSmall organic molecule
Emp. Form.C25H42N10O2S
Mol. Mass.546.732
SMILESCc1nc(N)sc1CCCN=C(N)NC(=O)CCCCCCCCC(=O)NC(N)=NCCCc1cnc[nH]1