Reaction Details
TargetAdenosine receptor A1
LigandBDBM50394717
Substrate/Competitorn/a
Meas. Tech.ChEMBL_858813 (CHEMBL2167688)
Ki 1.8±n/a nM
Citation Shook, BCRassnick, SWallace, NCrooke, JAult, MChakravarty, DBarbay, JKWang, APowell, MTLeonard, KAlford, VScannevin, RHCarroll, KLampron, LWestover, LLim, HKRussell, RBranum, SWells, KMDamon, SYouells, SLi, XBeauchamp, DARhodes, KJackson, PF Design and characterization of optimized adenosine A2A/A1 receptor antagonists for the treatment of Parkinson's disease. J Med Chem55:1402-17 (2012) 
 
Adenosine receptor A1
Name:Adenosine receptor A1
Type:G Protein-Coupled Receptor (GPCR)
Mol. Mass.:36520.92
Organism:Homo sapiens (Human)
Description:P30542
Residue:326
BDBM50394717
NameBDBM50394717
Synonyms:CHEMBL2165802
TypeSmall organic molecule
Emp. Form.C23H14N4O2
Mol. Mass.378.3829
SMILESNc1nc2-c3cc(ccc3C(=O)c2c(n1)-c1ccccc1)C(=O)c1cccnc1