Reaction Details
TargetDelta-type opioid receptor
LigandBDBM50395067
Substrate/Competitorn/a
Meas. Tech.ChEMBL_859252 (CHEMBL2166337)
Ki 10980±n/a nM
Citation Wang, YXing, YLiu, XJi, HKai, MChen, ZYu, JZhao, DRen, HWang, R A new class of highly potent and selective endomorphin-1 analogues containinga-methylene-ß-aminopropanoic acids (map). J Med Chem55:6224-36 (2012) 
 
Delta-type opioid receptor
Name:Delta-type opioid receptor
Type:G Protein-Coupled Receptor (GPCR)
Mol. Mass.:40382.98
Organism:Homo sapiens (Human)
Description:Competition binding assays were carried out using membrane preparations from transfected HN9.10 cells that constitutively expressed the delta opioid receptor.
Residue:372
BDBM50395067
NameBDBM50395067
Synonyms:CHEMBL2163922
TypeSmall organic molecule
Emp. Form.C34H37N5O5
Mol. Mass.595.6881
SMILESN[C@@H](Cc1ccc(O)cc1)C(=O)N1CCC[C@H]1C(=O)N[C@H](C(=C)C(=O)N[C@H](C(=C)C(N)=O)c1ccccc1)c1ccccc1