Reaction Details
TargetDelta-type opioid receptor
LigandBDBM50395061
Substrate/Competitorn/a
Meas. Tech.ChEMBL_859252 (CHEMBL2166337)
Ki 18690±n/a nM
Citation Wang, YXing, YLiu, XJi, HKai, MChen, ZYu, JZhao, DRen, HWang, R A new class of highly potent and selective endomorphin-1 analogues containinga-methylene-ß-aminopropanoic acids (map). J Med Chem55:6224-36 (2012) 
 
Delta-type opioid receptor
Name:Delta-type opioid receptor
Type:G Protein-Coupled Receptor (GPCR)
Mol. Mass.:40382.98
Organism:Homo sapiens (Human)
Description:Competition binding assays were carried out using membrane preparations from transfected HN9.10 cells that constitutively expressed the delta opioid receptor.
Residue:372
BDBM50395061
NameBDBM50395061
Synonyms:CHEMBL2163915
TypeSmall organic molecule
Emp. Form.C36H38N6O7
Mol. Mass.666.7229
SMILESN[C@@H](Cc1ccc(O)cc1)C(=O)N1CCC[C@H]1C(=O)N[C@@H](Cc1c[nH]c2ccccc12)C(=O)N[C@H](C(=C)C(N)=O)c1ccc2OCOc2c1