Reaction Details
TargetMu-type opioid receptor
LigandBDBM50395062
Substrate/Competitorn/a
Meas. Tech.ChEMBL_859256 (CHEMBL2166341)
EC50 11±n/a nM
Citation Wang, YXing, YLiu, XJi, HKai, MChen, ZYu, JZhao, DRen, HWang, R A new class of highly potent and selective endomorphin-1 analogues containinga-methylene-ß-aminopropanoic acids (map). J Med Chem55:6224-36 (2012) 
 
Mu-type opioid receptor
Name:Mu-type opioid receptor
Type:G Protein-Coupled Receptor (GPCR)
Mol. Mass.:44789.51
Organism:Homo sapiens (Human)
Description:P35372
Residue:400
BDBM50395062
NameBDBM50395062
Synonyms:CHEMBL2163914
TypeSmall organic molecule
Emp. Form.C36H40N6O6
Mol. Mass.652.7394
SMILESCOc1ccc(cc1)[C@H](NC(=O)[C@H](Cc1c[nH]c2ccccc12)NC(=O)[C@@H]1CCCN1C(=O)[C@@H](N)Cc1ccc(O)cc1)C(=C)C(N)=O