Reaction Details
TargetMu-type opioid receptor
LigandBDBM50395058
Substrate/Competitorn/a
Meas. Tech.ChEMBL_859256 (CHEMBL2166341)
EC50 72±n/a nM
Citation Wang, YXing, YLiu, XJi, HKai, MChen, ZYu, JZhao, DRen, HWang, R A new class of highly potent and selective endomorphin-1 analogues containinga-methylene-ß-aminopropanoic acids (map). J Med Chem55:6224-36 (2012) 
 
Mu-type opioid receptor
Name:Mu-type opioid receptor
Type:G Protein-Coupled Receptor (GPCR)
Mol. Mass.:44789.51
Organism:Homo sapiens (Human)
Description:P35372
Residue:400
BDBM50395058
NameBDBM50395058
Synonyms:CHEMBL2163918
TypeSmall organic molecule
Emp. Form.C39H40N6O5
Mol. Mass.672.7721
SMILESN[C@@H](Cc1ccc(O)cc1)C(=O)N1CCC[C@H]1C(=O)N[C@@H](Cc1c[nH]c2ccccc12)C(=O)N[C@H](C(=C)C(N)=O)c1cccc2ccccc12