Reaction Details
TargetDelta-type opioid receptor
LigandBDBM50395058
Substrate/Competitorn/a
Meas. Tech.ChEMBL_859250 (CHEMBL2166335)
IC50 84±n/a nM
Citation Wang, YXing, YLiu, XJi, HKai, MChen, ZYu, JZhao, DRen, HWang, R A new class of highly potent and selective endomorphin-1 analogues containinga-methylene-ß-aminopropanoic acids (map). J Med Chem55:6224-36 (2012) 
 
Delta-type opioid receptor
Name:Delta-type opioid receptor
Type:Enzyme Catalytic Domain
Mol. Mass.:40577.25
Organism:MOUSE
Description:P32300
Residue:372
BDBM50395058
NameBDBM50395058
Synonyms:CHEMBL2163918
TypeSmall organic molecule
Emp. Form.C39H40N6O5
Mol. Mass.672.7721
SMILESN[C@@H](Cc1ccc(O)cc1)C(=O)N1CCC[C@H]1C(=O)N[C@@H](Cc1c[nH]c2ccccc12)C(=O)N[C@H](C(=C)C(N)=O)c1cccc2ccccc12