Reaction Details
TargetMu-type opioid receptor
LigandBDBM50395067
Substrate/Competitorn/a
Meas. Tech.ChEMBL_859254 (CHEMBL2166339)
IC50 38±n/a nM
Citation Wang, YXing, YLiu, XJi, HKai, MChen, ZYu, JZhao, DRen, HWang, R A new class of highly potent and selective endomorphin-1 analogues containinga-methylene-ß-aminopropanoic acids (map). J Med Chem55:6224-36 (2012) 
 
Mu-type opioid receptor
Name:Mu-type opioid receptor
Type:Enzyme Catalytic Domain
Mol. Mass.:11165.58
Organism:GUINEA PIG
Description:P97266
Residue:98
BDBM50395067
NameBDBM50395067
Synonyms:CHEMBL2163922
TypeSmall organic molecule
Emp. Form.C34H37N5O5
Mol. Mass.595.6881
SMILESN[C@@H](Cc1ccc(O)cc1)C(=O)N1CCC[C@H]1C(=O)N[C@H](C(=C)C(=O)N[C@H](C(=C)C(N)=O)c1ccccc1)c1ccccc1