Reaction Details
TargetNAD-dependent protein deacetylase sirtuin-2
LigandBDBM50395318
Substrate/Competitorn/a
Meas. Tech.ChEMBL_860557 (CHEMBL2167131)
IC50 6200±n/a nM
Citation Fridén-Saxin, MSeifert, TLandergren, MRSuuronen, TLahtela-Kakkonen, MJarho, EMLuthman, K Synthesis and evaluation of substituted chroman-4-one and chromone derivatives as sirtuin 2-selective inhibitors. J Med Chem55:7104-13 (2012) 
 
NAD-dependent protein deacetylase sirtuin-2
Name:NAD-dependent protein deacetylase sirtuin-2
Type:Hydrolase
Mol. Mass.:43172.62
Organism:Homo sapiens (Human)
Description:n/a
Residue:389
BDBM50395318
NameBDBM50395318
Synonyms:CHEMBL2164019
TypeSmall organic molecule
Emp. Form.C16H22O2
Mol. Mass.246.3447
SMILESCCCCCC1CC(=O)c2cc(C)cc(C)c2O1