Reaction Details
TargetNAD-dependent protein deacetylase sirtuin-2
LigandBDBM50395321
Substrate/Competitorn/a
Meas. Tech.ChEMBL_860557 (CHEMBL2167131)
IC50 4500±n/a nM
Citation Fridén-Saxin, MSeifert, TLandergren, MRSuuronen, TLahtela-Kakkonen, MJarho, EMLuthman, K Synthesis and evaluation of substituted chroman-4-one and chromone derivatives as sirtuin 2-selective inhibitors. J Med Chem55:7104-13 (2012) 
 
NAD-dependent protein deacetylase sirtuin-2
Name:NAD-dependent protein deacetylase sirtuin-2
Type:Hydrolase
Mol. Mass.:43172.62
Organism:Homo sapiens (Human)
Description:n/a
Residue:389
BDBM50395321
NameBDBM50395321
Synonyms:CHEMBL2164015
TypeSmall organic molecule
Emp. Form.C14H16BrClO2
Mol. Mass.331.633
SMILESCCCCC[C@@H]1CC(=O)c2cc(Cl)cc(Br)c2O1