Reaction Details
TargetCarbonic anhydrase 1
LigandBDBM50395392
Substrate/Competitorn/a
Meas. Tech.ChEMBL_857988 (CHEMBL2166496)
Ki 241±n/a nM
Citation D'Ambrosio, KSmaine, FZCarta, FDe Simone, GWinum, JYSupuran, CT Development of potent carbonic anhydrase inhibitors incorporating both sulfonamide and sulfamide groups. J Med Chem55:6776-83 (2012) 
 
Carbonic anhydrase 1
Name:Carbonic anhydrase 1
Type:Enzyme
Mol. Mass.:28873.37
Organism:Homo sapiens (Human)
Description:P00915
Residue:261
BDBM50395392
NameBDBM50395392
Synonyms:CHEMBL2164736
TypeSmall organic molecule
Emp. Form.C13H13N3O6S2
Mol. Mass.371.389
SMILESNS(=O)(=O)Nc1ccc(cc1)S(=O)(=O)Nc1ccc(cc1)C(O)=O