Reaction Details
TargetFatty-acid amide hydrolase 1
LigandBDBM50395424
Substrate/Competitorn/a
Meas. Tech.ChEMBL_858264 (CHEMBL2168070)
IC50 170±n/a nM
Citation Butini, SBrindisi, MGemma, SMinetti, PCabri, WGallo, GVincenti, STalamonti, EBorsini, FCaprioli, AStasi, MADi Serio, SRos, SBorrelli, GMaramai, SFezza, FCampiani, GMaccarrone, M Discovery of potent inhibitors of human and mouse fatty acid amide hydrolases. J Med Chem55:6898-915 (2012) 
 
Fatty-acid amide hydrolase 1
Name:Fatty-acid amide hydrolase 1
Type:Protein
Mol. Mass.:63071.19
Organism:Homo sapiens (Human)
Description:O00519
Residue:579
BDBM50395424
NameBDBM50395424
Synonyms:CHEMBL2165083
TypeSmall organic molecule
Emp. Form.C23H29N3O3
Mol. Mass.395.4947
SMILESNC(=O)c1ccn(c1)-c1cccc(OC(=O)NCCCCCCCCCC#C)c1