Reaction Details
TargetFatty-acid amide hydrolase 1
LigandBDBM50395425
Substrate/Competitorn/a
Meas. Tech.ChEMBL_858269 (CHEMBL2168075)
IC50 120±n/a nM
Citation Butini, SBrindisi, MGemma, SMinetti, PCabri, WGallo, GVincenti, STalamonti, EBorsini, FCaprioli, AStasi, MADi Serio, SRos, SBorrelli, GMaramai, SFezza, FCampiani, GMaccarrone, M Discovery of potent inhibitors of human and mouse fatty acid amide hydrolases. J Med Chem55:6898-915 (2012) 
 
Fatty-acid amide hydrolase 1
Name:Fatty-acid amide hydrolase 1
Type:Hydrolase; single-pass membrane protein; homodimer
Mol. Mass.:63227.28
Organism:Mus musculus (mouse)
Description:Mouse brain membranes were used in the assay.
Residue:579
BDBM50395425
NameBDBM50395425
Synonyms:CHEMBL2165082
TypeSmall organic molecule
Emp. Form.C18H21N3O3
Mol. Mass.327.3776
SMILESNC(=O)c1ccn(c1)-c1cccc(OC(=O)NC2CCCCC2)c1