Reaction Details
TargetFatty-acid amide hydrolase 1
LigandBDBM26739
Substrate/Competitorn/a
Meas. Tech.ChEMBL_858269 (CHEMBL2168075)
Ki 1.2±n/a nM
Citation Butini, SBrindisi, MGemma, SMinetti, PCabri, WGallo, GVincenti, STalamonti, EBorsini, FCaprioli, AStasi, MADi Serio, SRos, SBorrelli, GMaramai, SFezza, FCampiani, GMaccarrone, M Discovery of potent inhibitors of human and mouse fatty acid amide hydrolases. J Med Chem55:6898-915 (2012) 
 
Fatty-acid amide hydrolase 1
Name:Fatty-acid amide hydrolase 1
Type:Hydrolase; single-pass membrane protein; homodimer
Mol. Mass.:63227.28
Organism:Mus musculus (mouse)
Description:Mouse brain membranes were used in the assay.
Residue:579
BDBM26739
NameBDBM26739
Synonyms:3-(3-carbamoylphenyl)phenyl N-cyclohexylcarbamate URB 597 URB597 | US9187413, 1a (URB597)
TypeSmall organic molecule
Emp. Form.C20H22N2O3
Mol. Mass.338.4003
SMILESNC(=O)c1cccc(c1)-c1cccc(OC(=O)NC2CCCCC2)c1