Reaction Details
TargetFatty-acid amide hydrolase 1
LigandBDBM50395436
Substrate/Competitorn/a
Meas. Tech.ChEMBL_858269 (CHEMBL2168075)
IC50>200±n/a nM
Citation Butini, SBrindisi, MGemma, SMinetti, PCabri, WGallo, GVincenti, STalamonti, EBorsini, FCaprioli, AStasi, MADi Serio, SRos, SBorrelli, GMaramai, SFezza, FCampiani, GMaccarrone, M Discovery of potent inhibitors of human and mouse fatty acid amide hydrolases. J Med Chem55:6898-915 (2012) 
 
Fatty-acid amide hydrolase 1
Name:Fatty-acid amide hydrolase 1
Type:Hydrolase; single-pass membrane protein; homodimer
Mol. Mass.:63227.28
Organism:Mus musculus (mouse)
Description:Mouse brain membranes were used in the assay.
Residue:579
BDBM50395436
NameBDBM50395436
Synonyms:CHEMBL2165089
TypeSmall organic molecule
Emp. Form.C35H44N2O4
Mol. Mass.556.7349
SMILESO=C(NCCCCCCc1ccccc1)Oc1cccc(c1)-n1ccc(c1)C(=O)OCCCCCCCCCC#C