Reaction Details
TargetFatty-acid amide hydrolase 1
LigandBDBM50395445
Substrate/Competitorn/a
Meas. Tech.ChEMBL_858269 (CHEMBL2168075)
IC50 87±n/a nM
Citation Butini, SBrindisi, MGemma, SMinetti, PCabri, WGallo, GVincenti, STalamonti, EBorsini, FCaprioli, AStasi, MADi Serio, SRos, SBorrelli, GMaramai, SFezza, FCampiani, GMaccarrone, M Discovery of potent inhibitors of human and mouse fatty acid amide hydrolases. J Med Chem55:6898-915 (2012) 
 
Fatty-acid amide hydrolase 1
Name:Fatty-acid amide hydrolase 1
Type:Hydrolase; single-pass membrane protein; homodimer
Mol. Mass.:63227.28
Organism:Mus musculus (mouse)
Description:Mouse brain membranes were used in the assay.
Residue:579
BDBM50395445
NameBDBM50395445
Synonyms:CHEMBL2165077
TypeSmall organic molecule
Emp. Form.C22H23N3O5
Mol. Mass.409.4351
SMILESNC(=O)c1ccn(c1)-c1cccc(OC(=O)NCCOCCOc2ccccc2)c1