Reaction Details
TargetD(2) dopamine receptor
LigandBDBM50395576
Substrate/Competitorn/a
Meas. Tech.ChEMBL_859682 (CHEMBL2169117)
Ki 30±n/a nM
Citation Chen, XSassano, MFZheng, LSetola, VChen, MBai, XFrye, SVWetsel, WCRoth, BLJin, J Structure-functional selectivity relationship studies ofß-arrestin-biased dopamine D2 receptor agonists. J Med Chem55:7141-53 (2012) 
 
D(2) dopamine receptor
Name:D(2) dopamine receptor
Type:Cell-surface receptors
Mol. Mass.:50647.10
Organism:Homo sapiens (Human)
Description:P14416
Residue:443
BDBM50395576
NameBDBM50395576
Synonyms:CHEMBL2165139 US9156822, 23
TypeSmall organic molecule
Emp. Form.C20H21Cl2N3OS
Mol. Mass.422.371
SMILESClc1cccc(N2CCN(CCCOc3ccc4scnc4c3)CC2)c1Cl