Reaction Details
TargetD(2) dopamine receptor
LigandBDBM50395586
Substrate/Competitorn/a
Meas. Tech.ChEMBL_859682 (CHEMBL2169117)
Ki 145±n/a nM
Citation Chen, XSassano, MFZheng, LSetola, VChen, MBai, XFrye, SVWetsel, WCRoth, BLJin, J Structure-functional selectivity relationship studies ofß-arrestin-biased dopamine D2 receptor agonists. J Med Chem55:7141-53 (2012) 
 
D(2) dopamine receptor
Name:D(2) dopamine receptor
Type:Cell-surface receptors
Mol. Mass.:50647.10
Organism:Homo sapiens (Human)
Description:P14416
Residue:443
BDBM50395586
NameBDBM50395586
Synonyms:CHEMBL2165128
TypeSmall organic molecule
Emp. Form.C27H33Cl2N3O2
Mol. Mass.502.476
SMILESClc1cccc(N2CCN(C[C@H]3CC[C@H](COc4ccc5CCC(=O)Nc5c4)CC3)CC2)c1Cl