Reaction Details
TargetD(2) dopamine receptor
LigandBDBM50395564
Substrate/Competitorn/a
Meas. Tech.ChEMBL_859682 (CHEMBL2169117)
Ki 5.5±n/a nM
Citation Chen, XSassano, MFZheng, LSetola, VChen, MBai, XFrye, SVWetsel, WCRoth, BLJin, J Structure-functional selectivity relationship studies ofß-arrestin-biased dopamine D2 receptor agonists. J Med Chem55:7141-53 (2012) 
 
D(2) dopamine receptor
Name:D(2) dopamine receptor
Type:Cell-surface receptors
Mol. Mass.:50647.10
Organism:Homo sapiens (Human)
Description:P14416
Residue:443
BDBM50395564
NameBDBM50395564
Synonyms:CHEMBL160630
TypeSmall organic molecule
Emp. Form.C23H28FN3O2
Mol. Mass.397.4857
SMILESFc1ccccc1N1CCN(CCCCOc2ccc3CCC(=O)Nc3c2)CC1