Reaction Details
TargetCarboxypeptidase B2
LigandBDBM50395737
Substrate/Competitorn/a
Meas. Tech.ChEMBL_860207 (CHEMBL2168947)
IC50>3800000±n/a nM
Citation Yoshimoto, NSasaki, TSugimoto, KIshii, HYamamoto, K Design and characterization of a selenium-containing inhibitor of activated thrombin-activatable fibrinolysis inhibitor (TAFIa), a zinc-containing metalloprotease. J Med Chem55:7696-705 (2012) 
 
Carboxypeptidase B2
Name:Carboxypeptidase B2
Type:Enzyme
Mol. Mass.:48432.74
Organism:Homo sapiens (Human)
Description:Q96IY4
Residue:423
BDBM50395737
NameBDBM50395737
Synonyms:CHEMBL2164457
TypeSmall organic molecule
Emp. Form.C16H32N2O4Se2
Mol. Mass.474.36
SMILESNCCCCCC(C[Se][Se]CC(CCCCCN)C(O)=O)C(O)=O