Reaction Details
TargetCarboxypeptidase B2
LigandBDBM50395729
Substrate/Competitorn/a
Meas. Tech.ChEMBL_860207 (CHEMBL2168947)
IC50>3800000±n/a nM
Citation Yoshimoto, NSasaki, TSugimoto, KIshii, HYamamoto, K Design and characterization of a selenium-containing inhibitor of activated thrombin-activatable fibrinolysis inhibitor (TAFIa), a zinc-containing metalloprotease. J Med Chem55:7696-705 (2012) 
 
Carboxypeptidase B2
Name:Carboxypeptidase B2
Type:Enzyme
Mol. Mass.:48432.74
Organism:Homo sapiens (Human)
Description:Q96IY4
Residue:423
BDBM50395729
NameBDBM50395729
Synonyms:CHEMBL2164451
TypeSmall organic molecule
Emp. Form.C14H19ClN2O3Se
Mol. Mass.377.73
SMILESCCOC(=O)C(C[Se]C(=O)CC)Cc1cnc(N)c(Cl)c1