Reaction Details
TargetCarboxypeptidase B
LigandBDBM50395730
Substrate/Competitorn/a
Meas. Tech.ChEMBL_860206 (CHEMBL2168946)
IC50 370000±n/a nM
Citation Yoshimoto, NSasaki, TSugimoto, KIshii, HYamamoto, K Design and characterization of a selenium-containing inhibitor of activated thrombin-activatable fibrinolysis inhibitor (TAFIa), a zinc-containing metalloprotease. J Med Chem55:7696-705 (2012) 
 
Carboxypeptidase B
Name:Carboxypeptidase B
Type:PROTEIN
Mol. Mass.:47371.10
Organism:Sus scrofa
Description:ChEMBL_453905
Residue:416
BDBM50395730
NameBDBM50395730
Synonyms:CHEMBL2164450
TypeSmall organic molecule
Emp. Form.C18H20Cl2N4O4Se2
Mol. Mass.585.2
SMILESNc1ncc(CC(C[Se][Se]CC(Cc2cnc(N)c(Cl)c2)C(O)=O)C(O)=O)cc1Cl