Reaction Details
TargetCarboxypeptidase B
LigandBDBM50395732
Substrate/Competitorn/a
Meas. Tech.ChEMBL_860206 (CHEMBL2168946)
IC50 280±n/a nM
Citation Yoshimoto, NSasaki, TSugimoto, KIshii, HYamamoto, K Design and characterization of a selenium-containing inhibitor of activated thrombin-activatable fibrinolysis inhibitor (TAFIa), a zinc-containing metalloprotease. J Med Chem55:7696-705 (2012) 
 
Carboxypeptidase B
Name:Carboxypeptidase B
Type:PROTEIN
Mol. Mass.:47371.10
Organism:Sus scrofa
Description:ChEMBL_453905
Residue:416
BDBM50395732
NameBDBM50395732
Synonyms:CHEMBL2164462
TypeSmall organic molecule
Emp. Form.C18H22N4O4Se2
Mol. Mass.516.31
SMILESNc1ccc(CC(C[Se][Se]CC(Cc2ccc(N)nc2)C(O)=O)C(O)=O)cn1