Reaction Details
TargetCarboxypeptidase B
LigandBDBM50395737
Substrate/Competitorn/a
Meas. Tech.ChEMBL_860206 (CHEMBL2168946)
IC50 110000±n/a nM
Citation Yoshimoto, NSasaki, TSugimoto, KIshii, HYamamoto, K Design and characterization of a selenium-containing inhibitor of activated thrombin-activatable fibrinolysis inhibitor (TAFIa), a zinc-containing metalloprotease. J Med Chem55:7696-705 (2012) 
 
Carboxypeptidase B
Name:Carboxypeptidase B
Type:PROTEIN
Mol. Mass.:47371.10
Organism:Sus scrofa
Description:ChEMBL_453905
Residue:416
BDBM50395737
NameBDBM50395737
Synonyms:CHEMBL2164457
TypeSmall organic molecule
Emp. Form.C16H32N2O4Se2
Mol. Mass.474.36
SMILESNCCCCCC(C[Se][Se]CC(CCCCCN)C(O)=O)C(O)=O