Reaction Details
TargetCarboxypeptidase B
LigandBDBM50395739
Substrate/Competitorn/a
Meas. Tech.ChEMBL_860206 (CHEMBL2168946)
IC50 260000±n/a nM
Citation Yoshimoto, NSasaki, TSugimoto, KIshii, HYamamoto, K Design and characterization of a selenium-containing inhibitor of activated thrombin-activatable fibrinolysis inhibitor (TAFIa), a zinc-containing metalloprotease. J Med Chem55:7696-705 (2012) 
 
Carboxypeptidase B
Name:Carboxypeptidase B
Type:PROTEIN
Mol. Mass.:47371.10
Organism:Sus scrofa
Description:ChEMBL_453905
Residue:416
BDBM50395739
NameBDBM50395739
Synonyms:CHEMBL2164455
TypeSmall organic molecule
Emp. Form.C10H21NO2S
Mol. Mass.219.344
SMILESCCOC(=O)C(CS)CCCCCN