Reaction Details
TargetGrowth hormone secretagogue receptor type 1
LigandBDBM50395755
Substrate/Competitorn/a
Meas. Tech.ChEMBL_860218 (CHEMBL2169159)
IC50 213±n/a nM
Citation Puleo, LMarini, PAvallone, RZanchet, MBandiera, SBaroni, MCroci, T Synthesis and pharmacological evaluation of indolinone derivatives as novel ghrelin receptor antagonists. Bioorg Med Chem20:5623-36 (2012) 
 
Growth hormone secretagogue receptor type 1
Name:Growth hormone secretagogue receptor type 1
Type:Receptor
Mol. Mass.:41334.57
Organism:Homo sapiens (Human)
Description:Receptor binding studies use plasma membranes from LLC PK-1 cells transiently transfected with hGHSR1a.
Residue:366
BDBM50395755
NameBDBM50395755
Synonyms:CHEMBL2164494
TypeSmall organic molecule
Emp. Form.C22H24Cl2N4O2
Mol. Mass.447.358
SMILESCN1CCN(CC(=O)NC2(C(=O)Nc3cc(Cl)c(C)cc23)c2ccc(Cl)cc2)CC1