Reaction Details
TargetPhosphatidylinositol 4,5-bisphosphate 3-kinase catalytic subunit beta isoform
LigandBDBM50395812
Substrate/Competitorn/a
Meas. Tech.ChEMBL_860617 (CHEMBL2167591)
IC50 100±n/a nM
Citation Giordanetto, FWållberg, AGhosal, SIliefski, TCassel, JYuan, ZQvon Wachenfeldt, HAndersen, SMInghardt, TTunek, ANylander, S Discovery of phosphoinositide 3-kinases (PI3K) p110ß isoform inhibitor 4-[2-hydroxyethyl(1-naphthylmethyl)amino]-6-[(2S)-2-methylmorpholin-4-yl]-1H-pyrimidin-2-one, an effective antithrombotic agent without associated bleeding and insulin resistance. Bioorg Med Chem Lett22:6671-6 (2012) 
 
Phosphatidylinositol 4,5-bisphosphate 3-kinase catalytic subunit beta isoform
Name:Phosphatidylinositol 4,5-bisphosphate 3-kinase catalytic subunit beta isoform
Type:Enzyme Subunit
Mol. Mass.:122769.00
Organism:Homo sapiens (Human)
Description:P42338
Residue:1070
BDBM50395812
NameBDBM50395812
Synonyms:CHEMBL2165181
TypeSmall organic molecule
Emp. Form.C22H26N4O3
Mol. Mass.394.4668
SMILESOCCCN(Cc1cccc2ccccc12)c1cc(nc(=O)[nH]1)N1CCOCC1