Reaction Details
Target5-hydroxytryptamine receptor 6
LigandBDBM50395843
Substrate/Competitorn/a
Meas. Tech.ChEMBL_861074 (CHEMBL2166665)
Ki 24.3±n/a nM
Citation Nirogi, RVKonda, JBKambhampati, RShinde, ABandyala, TRGudla, PKandukuri, KKJayarajan, PKandikere, VDubey, PK N,N-Dimethyl-[9-(arylsulfonyl)-2,3,4,9-tetrahydro-1H-carbazol-3-yl]amines as novel, potent and selective 5-HT6 receptor antagonists. Bioorg Med Chem Lett22:6980-5 (2012) 
 
5-hydroxytryptamine receptor 6
Name:5-hydroxytryptamine receptor 6
Type:G Protein-Coupled Receptor (GPCR)
Mol. Mass.:46968.43
Organism:Homo sapiens (Human)
Description:P50406
Residue:440
BDBM50395843
NameBDBM50395843
Synonyms:CHEMBL2165536
TypeSmall organic molecule
Emp. Form.C21H23FN2O3S
Mol. Mass.402.482
SMILESCOc1ccc2n(c3CCC(Cc3c2c1)N(C)C)S(=O)(=O)c1ccc(F)cc1