Reaction Details
Target5-hydroxytryptamine receptor 6
LigandBDBM50395861
Substrate/Competitorn/a
Meas. Tech.ChEMBL_861074 (CHEMBL2166665)
Ki 39.1±n/a nM
Citation Nirogi, RVKonda, JBKambhampati, RShinde, ABandyala, TRGudla, PKandukuri, KKJayarajan, PKandikere, VDubey, PK N,N-Dimethyl-[9-(arylsulfonyl)-2,3,4,9-tetrahydro-1H-carbazol-3-yl]amines as novel, potent and selective 5-HT6 receptor antagonists. Bioorg Med Chem Lett22:6980-5 (2012) 
 
5-hydroxytryptamine receptor 6
Name:5-hydroxytryptamine receptor 6
Type:G Protein-Coupled Receptor (GPCR)
Mol. Mass.:46968.43
Organism:Homo sapiens (Human)
Description:P50406
Residue:440
BDBM50395861
NameBDBM50395861
Synonyms:CHEMBL2163740
TypeSmall organic molecule
Emp. Form.C20H19F3N2O3S
Mol. Mass.424.437
SMILESCOc1ccc2n(c3CCC(N)Cc3c2c1)S(=O)(=O)c1cccc(c1)C(F)(F)F