Reaction Details
TargetCholinesterase
LigandBDBM50396012
Substrate/Competitorn/a
Meas. Tech.ChEMBL_858573 (CHEMBL2166018)
IC50 2530±n/a nM
Citation Brunhofer, GFallarero, AKarlsson, DBatista-Gonzalez, AShinde, PGopi Mohan, CVuorela, P Exploration of natural compounds as sources of new bifunctional scaffolds targeting cholinesterases and beta amyloid aggregation: the case of chelerythrine. Bioorg Med Chem20:6669-79 (2012) 
 
Cholinesterase
Name:Cholinesterase
Type:Enzyme
Mol. Mass.:65643.35
Organism:Equus caballus (Horse)
Description:P81908
Residue:574
BDBM50396012
NameBDBM50396012
Synonyms:CHEMBL2163791
TypeSmall organic molecule
Emp. Form.C11H12N2O
Mol. Mass.188.2258
SMILESO[C@H]1CCN2Cc3ccccc3N=C12