Reaction Details
TargetLysine-specific histone demethylase 1A
LigandBDBM50396013
Substrate/Competitorn/a
Meas. Tech.ChEMBL_861226 (CHEMBL2173364)
IC50 500±n/a nM
Citation Decarlo, DHadden, MK Oncoepigenomics: making histone lysine methylation count. Eur J Med Chem56:179-194 (2012) 
 
Lysine-specific histone demethylase 1A
Name:Lysine-specific histone demethylase 1A
Type:Enzyme
Mol. Mass.:92901.01
Organism:Homo sapiens (Human)
Description:O60341
Residue:852
BDBM50396013
NameBDBM50396013
Synonyms:CHEMBL1198896
TypeSmall organic molecule
Emp. Form.C15H36N8
Mol. Mass.328.4999
SMILES[#6]-[#7]\[#6](-[#7]-[#6])=[#7]/[#6]-[#6]-[#6]-[#7]-[#6]-[#6]-[#6]-[#7]-[#6]-[#6]-[#6]\[#7]=[#6](\[#7]-[#6])-[#7]-[#6]